[slicer-users] Compile ERROR: failed to run getbuildtest

Steve Pieper pieper at ibility.net
Fri Aug 19 15:33:54 EDT 2011


Hi Carolina -

Looks pretty good - I think you are all set.  The one error (failed test) is
one is one that tests the user interface and may have gotten stuck for some
reason (hence the timeout).  Chances are good that this isn't anything to
worry about.

-Steve

On Fri, Aug 19, 2011 at 1:28 PM, Carolina Valencia
<cvalencia at linkdx.com.co>wrote:

> Hi Steve,
>
> After fix the space problem and re-run I got some errors.
>
> Carolina
>
> 2011/8/19 Steve Pieper <pieper at ibility.net>
>
>> Hi Carolina -
>>
>> Sorry you're running into so much trouble here - your build is mostly
>> working, but now according to the results of your experimental build, you've
>> run out of disk space:
>>
>> http://www.cdash.org/CDash/viewBuildError.php?buildid=1446815
>>
>> [ 20%] Building CXX object Applications/CLI/BRAINSTools/BRAINSDemonWarp/CMakeFiles/BRAINSDemonWarpCommonLib.dir/BRAINSDemonWarpTemplates_Vdouble.cxx.o
>> /tmp/ccTYTbLo.s: Assembler messages:
>>
>> *
>>
>> /tmp/ccTYTbLo.s:1703481: Fatal error: can't close CMakeFiles/BRAINSFitLib.dir/BRAINSFitPrimary.cxx.o: No space left on device
>>
>> *
>>
>> make[6]: se sale del directorio «/.../Slicer3-build»
>>
>>
>> is it possible for you to use a different disk or free up some space?
>>
>> -Steve
>>
>>
>> On Fri, Aug 19, 2011 at 10:50 AM, Carolina Valencia <
>> cvalencia at linkdx.com.co> wrote:
>>
>>> Hi Steve,
>>> I replace the file you sent me, but it still fails,
>>> See the attached log file,
>>>
>>> Carolina
>>>
>>>
>>>
>>> 2011/8/19 Steve Pieper <pieper at ibility.net>
>>>
>>>> Ah - sorry it seems we have an english bias when it comes to
>>>> interpreting svn :)
>>>>
>>>> I just checked in a fix for this, but only in the development trunk (not
>>>> the 3.6 branch).  You can try the fix in your build by downloading the
>>>> attached file and replacing the file of the same name in the Slicer3/Scripts
>>>> directory.  From there I would think all will work for you.
>>>>
>>>> -Steve
>>>>
>>>>
>>>> On Fri, Aug 19, 2011 at 9:31 AM, Carolina Valencia <
>>>> cvalencia at linkdx.com.co> wrote:
>>>>
>>>>> Hi Steve,
>>>>>
>>>>> Thanks for the qick answer,
>>>>> the output was:
>>>>>
>>>>> Ruta: .
>>>>> URL: http://svn.slicer.org/Slicer3/branches/Slicer-3-6
>>>>> Raíz del repositorio: http://svn.slicer.org/Slicer3
>>>>> UUID del repositorio: 3bd1e089-480b-0410-8dfb-8563597acbee
>>>>> Revisión: 16823
>>>>> Tipo de nodo: directorio
>>>>> Agendado: normal
>>>>> Autor del último cambio: domibel
>>>>> Revisión del último cambio: 16764
>>>>> Fecha de último cambio: 2011-07-25 13:59:49 -0500 (lun 25 de jul de
>>>>> 2011)
>>>>>
>>>>>
>>>>> 2011/8/19 Steve Pieper <pieper at ibility.net>
>>>>>
>>>>>> Hi Carolina -
>>>>>>
>>>>>> Interesting - looks like it almost finished but as you saw, it ran
>>>>>> into a problem with svn, in this case parsing the version information.
>>>>>>
>>>>>> Could you run the following commands:
>>>>>>
>>>>>> cd /home/cvalencia/Slicer3
>>>>>> svn info
>>>>>>
>>>>>> and send me the output?
>>>>>>
>>>>>> FYI on my machine I get this output:
>>>>>>
>>>>>> Path: .
>>>>>> URL: http://svn.slicer.org/Slicer3/trunk
>>>>>> Repository Root: http://svn.slicer.org/Slicer3
>>>>>> Repository UUID: 3bd1e089-480b-0410-8dfb-8563597acbee
>>>>>> Revision: 16821
>>>>>> Node Kind: directory
>>>>>> Schedule: normal
>>>>>> Last Changed Author: pieper
>>>>>> Last Changed Rev: 16821
>>>>>> Last Changed Date: 2011-08-15 15:28:42 -0400 (Mon, 15 Aug 2011)
>>>>>>
>>>>>>
>>>>>> Thanks,
>>>>>> Steve
>>>>>>
>>>>>>
>>>>>> On Fri, Aug 19, 2011 at 9:18 AM, Carolina Valencia <
>>>>>> cvalencia at linkdx.com.co> wrote:
>>>>>>
>>>>>>> HI,
>>>>>>>
>>>>>>> I erase all the folders and re run the commands to build the slicer
>>>>>>> version, but I'm still facing a problem. Something related to SVN
>>>>>>>
>>>>>>> Attached the log file,
>>>>>>>
>>>>>>> Thanks for your help,
>>>>>>>
>>>>>>> Carolina
>>>>>>>
>>>>>>>
>>>>>>> 2011/8/17 Carolina Valencia <cvalencia at linkdx.com.co>
>>>>>>>
>>>>>>>> Hi Dominique,
>>>>>>>>
>>>>>>>> I follow your steps but it shows a new error. See the log file:
>>>>>>>>
>>>>>>>> Sourcing /home/cvalencia/Slicer3/slicer_variables.tcl
>>>>>>>> Slicer3_HOME is /home/cvalencia/Slicer3
>>>>>>>> making with make -j 2
>>>>>>>> running: svn switch http://svn.slicer.org/Slicer3/trunk
>>>>>>>> U
>>>>>>>>  Modules/EMSegment/Qt/Widgets/qSlicerEMSegmentAnatomicalTreeWidget.cxx
>>>>>>>> U
>>>>>>>>  Modules/EMSegment/Qt/Widgets/qSlicerEMSegmentAnatomicalTreeWidget_p.h
>>>>>>>> U
>>>>>>>>  Modules/EMSegment/Qt/Widgets/qSlicerEMSegmentAnatomicalTreeWidget.h
>>>>>>>> U    Modules/EMSegment/Qt/Py/EMSegmentPy.py
>>>>>>>> U
>>>>>>>>  Modules/EMSegment/Qt/Py/EMSegmentWizard/EMSegmentDefineMiscParametersStep.py
>>>>>>>> U
>>>>>>>>  Modules/EMSegment/Qt/Py/EMSegmentWizard/EMSegmentDefinePreprocessingStep.py
>>>>>>>> U
>>>>>>>>  Modules/EMSegment/Qt/Py/EMSegmentWizard/EMSegmentSpecifyIntensityDistributionStep.py
>>>>>>>> U
>>>>>>>>  Modules/EMSegment/Qt/Py/EMSegmentWizard/EMSegmentStartSegmentationStep.py
>>>>>>>> U    Modules/EMSegment/Qt/Py/EMSegmentWizard/Helper.py
>>>>>>>> U    Modules/EMSegment/Qt/Py/EMSegmentWizard/EMSegmentStep.py
>>>>>>>> Actualizado a la revisión 16822.
>>>>>>>>
>>>>>>>> running: sh ./Scripts/genlib.tcl
>>>>>>>> /home/cvalencia/Slicer3/../Slicer3-lib --gcc -32 --test-type Experimental
>>>>>>>> Sourcing /home/cvalencia/Slicer3/slicer_variables.tcl
>>>>>>>> Slicer3_HOME is /home/cvalencia/Slicer3
>>>>>>>> BLT test file
>>>>>>>> /home/cvalencia/Slicer3/../Slicer3-lib/tcl-build/bin/bltwish24 not found.
>>>>>>>> All packages compiled.
>>>>>>>>
>>>>>>>> running:
>>>>>>>> /home/cvalencia/Slicer3/../Slicer3-lib/CMake-build/bin/cmake {-GUnix
>>>>>>>> Makefiles} {-DMAKECOMMAND:STRING=make -j 2}
>>>>>>>> -DCMAKE_CXX_COMPILER:STRING=/usr/bin/g++
>>>>>>>> -DCMAKE_CXX_COMPILER_FULLPATH:FILEPATH=/usr/bin/g++
>>>>>>>> -DITK_DIR:FILEPATH=/home/cvalencia/Slicer3/../Slicer3-lib/Insight-build
>>>>>>>> -DKWWidgets_DIR:FILEPATH=/home/cvalencia/Slicer3/../Slicer3-lib/KWWidgets-build
>>>>>>>> -DOpenCV_DIR:FILEPATH=/home/cvalencia/Slicer3/../Slicer3-lib/OpenCV-build
>>>>>>>> -DTeem_DIR:FILEPATH=/home/cvalencia/Slicer3/../Slicer3-lib/teem-build
>>>>>>>> -DOpenIGTLink_DIR:FILEPATH=/home/cvalencia/Slicer3/../Slicer3-lib/OpenIGTLink-build
>>>>>>>> -DBatchMake_DIR:FILEPATH=/home/cvalencia/Slicer3/../Slicer3-lib/BatchMake-build
>>>>>>>> -DSlicer3_USE_BatchMake=OFF
>>>>>>>> -DINCR_TCL_LIBRARY:FILEPATH=/home/cvalencia/Slicer3/../Slicer3-lib/tcl-build/lib/itcl3.4/
>>>>>>>> libitcl3.4.so-DINCR_TK_LIBRARY:FILEPATH=/home/cvalencia/Slicer3/../Slicer3-lib/tcl-build/lib/itk3.4/
>>>>>>>> libitk3.4.so -DSlicer3_USE_PYTHON=ON
>>>>>>>> -DSlicer3_USE_SYSTEM_PYTHON=OFF -DSlicer3_USE_NUMPY=ON
>>>>>>>> -DSlicer3_USE_OPENIGTLINK=ON -DSlicer3_USE_OPENCV=OFF
>>>>>>>> -DPYTHON_INCLUDE_PATH:PATH=/home/cvalencia/Slicer3/../Slicer3-lib/python-build/include/python2.6
>>>>>>>> -DPYTHON_LIBRARY:FILEPATH=/home/cvalencia/Slicer3/../Slicer3-lib/python-build/lib/
>>>>>>>> libpython2.6.so-DSandBox_DIR:FILEPATH=/home/cvalencia/Slicer3/../Slicer3-lib/NAMICSandBox
>>>>>>>> -DCMAKE_BUILD_TYPE=Debug -DSlicer3_VERSION_PATCH:STRING=2011-08-17
>>>>>>>> -DCPACK_GENERATOR:STRING=TGZ
>>>>>>>> -DCPACK_PACKAGE_FILE_NAME:STRING=Slicer3-3.6.4-beta-2011-08-17-linux-x86
>>>>>>>> -DCPACK_RPM_SPEC_MORE_DEFINE=
>>>>>>>> -DSLICERLIBCURL_DIR:FILEPATH=/home/cvalencia/Slicer3/../Slicer3-lib/cmcurl-build
>>>>>>>> -DCMAKE_VERBOSE_MAKEFILE:BOOL=OFF -DLAUNCHER_REPORT_VTK_ERRORS=OFF
>>>>>>>> -DSITE:STRING=cvalencia-Precision-WorkStation-T3400-cvalencia
>>>>>>>> /home/cvalencia/Slicer3
>>>>>>>> -- The C compiler identification is GNU
>>>>>>>> -- The CXX compiler identification is GNU
>>>>>>>> -- Check for working C compiler: /usr/bin/gcc
>>>>>>>> -- Check for working C compiler: /usr/bin/gcc -- broken
>>>>>>>> CMake Error at
>>>>>>>> /home/cvalencia/Slicer3-lib/CMake/Modules/CMakeTestCCompiler.cmake:52
>>>>>>>> (MESSAGE):
>>>>>>>>   The C compiler "/usr/bin/gcc" is not able to compile a simple test
>>>>>>>> program.
>>>>>>>>
>>>>>>>>   It fails with the following output:
>>>>>>>>
>>>>>>>>    Change Dir: /home/cvalencia/Slicer3-build/CMakeFiles/CMakeTmp
>>>>>>>>
>>>>>>>>
>>>>>>>>
>>>>>>>>   Run Build Command:/usr/bin/make "cmTryCompileExec/fast"
>>>>>>>>
>>>>>>>>   /usr/bin/make -f CMakeFiles/cmTryCompileExec.dir/build.make
>>>>>>>>   CMakeFiles/cmTryCompileExec.dir/build
>>>>>>>>
>>>>>>>>   make[1]: se ingresa al directorio
>>>>>>>>   «/home/cvalencia/Slicer3-build/CMakeFiles/CMakeTmp»
>>>>>>>>
>>>>>>>>   /home/cvalencia/Slicer3-lib/CMake-build/bin/cmake -E
>>>>>>>> cmake_progress_report
>>>>>>>>   /home/cvalencia/Slicer3-build/CMakeFiles/CMakeTmp/CMakeFiles
>>>>>>>>
>>>>>>>>   Building C object
>>>>>>>> CMakeFiles/cmTryCompileExec.dir/testCCompiler.c.o
>>>>>>>>
>>>>>>>>   /usr/bin/gcc -o CMakeFiles/cmTryCompileExec.dir/testCCompiler.c.o
>>>>>>>> -c
>>>>>>>>   /home/cvalencia/Slicer3-build/CMakeFiles/CMakeTmp/testCCompiler.c
>>>>>>>>
>>>>>>>>
>>>>>>>> /home/cvalencia/Slicer3-build/CMakeFiles/CMakeTmp/testCCompiler.c:11: fatal
>>>>>>>>   error: error closing /tmp/ccnHt33K.s: No queda espacio en el
>>>>>>>> dispositivo
>>>>>>>>
>>>>>>>>   compilation terminated.
>>>>>>>>
>>>>>>>>   make[1]: se sale del directorio
>>>>>>>>   «/home/cvalencia/Slicer3-build/CMakeFiles/CMakeTmp»
>>>>>>>>
>>>>>>>>   make[1]: *** [CMakeFiles/cmTryCompileExec.dir/testCCompiler.c.o]
>>>>>>>> Error 1
>>>>>>>>
>>>>>>>>   make: *** [cmTryCompileExec/fast] Error 2
>>>>>>>>
>>>>>>>>
>>>>>>>>
>>>>>>>>
>>>>>>>>
>>>>>>>>   CMake will not be able to correctly generate this project.
>>>>>>>> Call Stack (most recent call first):
>>>>>>>>   CMakeLists.txt:1 (PROJECT)
>>>>>>>>
>>>>>>>>
>>>>>>>> -- Configuring incomplete, errors occurred!
>>>>>>>>
>>>>>>>> child process exited abnormally
>>>>>>>> 1
>>>>>>>>     while executing
>>>>>>>> "error $ret"
>>>>>>>>     (procedure "runcmd" line 23)
>>>>>>>>     invoked from within
>>>>>>>>  "runcmd $::CMAKE \
>>>>>>>>         -G$::GENERATOR \
>>>>>>>>         -DMAKECOMMAND:STRING=$::MAKE \
>>>>>>>>         -DCMAKE_CXX_COMPILER:STRING=$COMPILER_PATH/$COMPILER \
>>>>>>>>      ..."
>>>>>>>>     (file "./Slicer3/Scripts/getbuildtest.tcl" line 543)
>>>>>>>>
>>>>>>>>
>>>>>>>>
>>>>>>>> 2011/8/16 Dominique Belhachemi <domibel at debian.org>
>>>>>>>>
>>>>>>>>> Hi Carolina,
>>>>>>>>>
>>>>>>>>> The tcl version Slicer3 is using has changed. Please delete the two
>>>>>>>>> directories
>>>>>>>>>
>>>>>>>>>     Slicer3-lib and Slicer3-build
>>>>>>>>>
>>>>>>>>> and run the build script again:
>>>>>>>>>
>>>>>>>>>     ./Slicer3/Scripts/getbuildtest.tcl
>>>>>>>>>
>>>>>>>>> Thanks
>>>>>>>>> Dominique
>>>>>>>>>
>>>>>>>>>
>>>>>>>>>
>>>>>>>>> On Tue, Aug 16, 2011 at 10:48 AM, cvalencia <
>>>>>>>>> cvalencia at linkdx.com.co> wrote:
>>>>>>>>> > HI Steve,
>>>>>>>>> > I got the log file
>>>>>>>>> > Sourcing /home/cvalencia/Slicer3/slicer_variables.tcl
>>>>>>>>> > Slicer3_HOME is /home/cvalencia/Slicer3
>>>>>>>>> > making with make -j 2
>>>>>>>>> > running: svn switch http://svn.slicer.org/Slicer3/trunk
>>>>>>>>> > En la revisión 16821.
>>>>>>>>> > running: sh ./Scripts/genlib.tcl
>>>>>>>>> /home/cvalencia/Slicer3/../Slicer3-lib
>>>>>>>>> > --gcc -32 --test-type Experimental
>>>>>>>>> > Sourcing /home/cvalencia/Slicer3/slicer_variables.tcl
>>>>>>>>> > Slicer3_HOME is /home/cvalencia/Slicer3
>>>>>>>>> > running: svn co
>>>>>>>>> http://svn.slicer.org/Slicer3-lib-mirrors/trunk/tcl85/tcl
>>>>>>>>> > tcl
>>>>>>>>> > svn: «tcl» ya es una copia de trabajo para un URL diferente
>>>>>>>>> > child process exited abnormally
>>>>>>>>> > 1
>>>>>>>>> >     while executing
>>>>>>>>> > "error $ret"
>>>>>>>>> >     (procedure "runcmd" line 23)
>>>>>>>>> >     invoked from within
>>>>>>>>> > "runcmd $::SVN co
>>>>>>>>> >
>>>>>>>>> http://svn.slicer.org/Slicer3-lib-mirrors/trunk/$::TCL_VERSION/tcltcl"
>>>>>>>>> >     invoked from within
>>>>>>>>> > "if { [BuildThis $::TCL_TEST_FILE "tcl"] == 1 } {
>>>>>>>>> >     if {$isWindows} {
>>>>>>>>> >       cd $::Slicer3_LIB
>>>>>>>>> >       if {$::GENLIB(bitness) == "64"} {
>>>>>>>>> >         runcmd..."
>>>>>>>>> >     (file "./Scripts/genlib.tcl" line 409)
>>>>>>>>> > child process exited abnormally
>>>>>>>>> > ERROR: failed to run getbuildtest: sh ./Scripts/genlib.tcl
>>>>>>>>> > /home/cvalencia/Slicer3/../Slicer3-lib --gcc -32 --test-type
>>>>>>>>> Experimental
>>>>>>>>> >
>>>>>>>>> > 2011/8/16 Steve Pieper [via slicer-users] <[hidden email]>
>>>>>>>>> >>
>>>>>>>>> >> Hi Carolina -
>>>>>>>>> >>
>>>>>>>>> >> You can generate a build log using the information here:
>>>>>>>>> >>
>>>>>>>>> >>
>>>>>>>>> >>
>>>>>>>>> http://www.slicer.org/slicerWiki/index.php/Slicer3:Build_Instructions#Errors_from_getbuildtest
>>>>>>>>> >>
>>>>>>>>> >> It should give some hints to work from.
>>>>>>>>> >>
>>>>>>>>> >> -Steve
>>>>>>>>> >>
>>>>>>>>> >> On Tue, Aug 16, 2011 at 9:49 AM, cvalencia <[hidden email]>
>>>>>>>>> wrote:
>>>>>>>>> >> > Hi Steve,
>>>>>>>>> >> > I have installed the package you mentioned and it seems to
>>>>>>>>> work, but
>>>>>>>>> >> > when I
>>>>>>>>> >> > try to launch the program, it fails and show me a messsage,
>>>>>>>>> >> > cvalencia at cvalencia-Precision-WorkStation-T3400:~$
>>>>>>>>> >> > ./Slicer3-build/Slicer3
>>>>>>>>> >> > sh: /home/cvalencia/Slicer3-build/bin/Slicer3-real: not found
>>>>>>>>> >> > Launch /home/cvalencia/Slicer3-build/bin/Slicer3-real returned
>>>>>>>>> with
>>>>>>>>> >> > error:
>>>>>>>>> >> > child process exited abnormally
>>>>>>>>> >> > where I can find the log of the build process to send to this
>>>>>>>>> forum? how
>>>>>>>>> >> > I
>>>>>>>>> >> > can fix this problem?}
>>>>>>>>> >> >
>>>>>>>>> >> > Thanks for the help,
>>>>>>>>> >> > Carolina
>>>>>>>>> >> > 2011/8/12 Steve Pieper [via slicer-users] <[hidden email]>
>>>>>>>>> >> >>
>>>>>>>>> >> >> Hi Carolina -
>>>>>>>>> >> >>
>>>>>>>>> >> >> It looks like you don't have the cvs package installed on
>>>>>>>>> your system.
>>>>>>>>> >> >>  You can find a list of prerequisites here:
>>>>>>>>> >> >>
>>>>>>>>> >> >>
>>>>>>>>> >> >>
>>>>>>>>> >> >>
>>>>>>>>> http://www.slicer.org/slicerWiki/index.php/Slicer3:Build_Instructions#getbuildtest_on_linux
>>>>>>>>> >> >>
>>>>>>>>> >> >> Best,
>>>>>>>>> >> >> Steve
>>>>>>>>> >> >>
>>>>>>>>> >> >> On Fri, Aug 12, 2011 at 9:53 AM, Carolina Valencia
>>>>>>>>> >> >> <[hidden email]> wrote:
>>>>>>>>> >> >> > Hi Slicer's users,
>>>>>>>>> >> >> > I'm trying to compile the last slicer version but I found a
>>>>>>>>> problem
>>>>>>>>> >> >> > running
>>>>>>>>> >> >> > the getbuiltest.tcl file.
>>>>>>>>> >> >> > I try to find an answer from similar posts in the slicer
>>>>>>>>> list but I'm
>>>>>>>>> >> >> > not so
>>>>>>>>> >> >> > sure which I must follow.
>>>>>>>>> >> >> > Could you clarify me, please?
>>>>>>>>> >> >> > All the best,
>>>>>>>>> >> >> > Carolina
>>>>>>>>> >> >> > cvalencia at cvalencia-Precision-WorkStation-T3400:~$
>>>>>>>>> >> >> > ./Slicer3/Scripts/getbuildtest.tcl
>>>>>>>>> >> >> > Sourcing /home/cvalencia/Slicer3/slicer_variables.tcl
>>>>>>>>> >> >> > Slicer3_HOME is /home/cvalencia/Slicer3
>>>>>>>>> >> >> > making with make -j 2
>>>>>>>>> >> >> > running: svn switch http://svn.slicer.org/Slicer3/trunk
>>>>>>>>> >> >> > U    Extensions/ANTS4Slicer/CMakeLists.txt
>>>>>>>>> >> >> > U    Modules/EMSegment/Tasks/GenericTask.tcl
>>>>>>>>> >> >> > U    Modules/EMSegment/vtkEMSegmentLogic.cxx
>>>>>>>>> >> >> > U    Modules/EMSegment/MRML/vtkMRMLEMSWorkingDataNode.cxx
>>>>>>>>> >> >> > U    Modules/EMSegment/vtkEMSegmentLogic.h
>>>>>>>>> >> >> > Actualizado a la revisión 16811.
>>>>>>>>> >> >> > running: sh ./Scripts/genlib.tcl
>>>>>>>>> >> >> > /home/cvalencia/Slicer3/../Slicer3-lib
>>>>>>>>> >> >> > --gcc -32 --test-type Experimental
>>>>>>>>> >> >> > Sourcing /home/cvalencia/Slicer3/slicer_variables.tcl
>>>>>>>>> >> >> > Slicer3_HOME is /home/cvalencia/Slicer3
>>>>>>>>> >> >> > running: cvs -d :pserver:anonymous:[hidden
>>>>>>>>> email]:/cvsroot/CMake
>>>>>>>>> >> >> > login
>>>>>>>>> >> >> > couldn't execute "cvs": no such file or directory
>>>>>>>>> >> >> >     while executing
>>>>>>>>> >> >> > "open "| $args |& cat" "r""
>>>>>>>>> >> >> >     (procedure "runcmd" line 11)
>>>>>>>>> >> >> >     invoked from within
>>>>>>>>> >> >> > "runcmd $::CVS -d :pserver:anonymous:[hidden
>>>>>>>>> email]:/cvsroot/CMake
>>>>>>>>> >> >> > login"
>>>>>>>>> >> >> >     invoked from within
>>>>>>>>> >> >> > "if { [BuildThis $::CMAKE "cmake"] == 1 } {
>>>>>>>>> >> >> >     file mkdir $::CMAKE_PATH
>>>>>>>>> >> >> >     cd $Slicer3_LIB
>>>>>>>>> >> >> >
>>>>>>>>> >> >> >     if {$isWindows} {
>>>>>>>>> >> >> >       runcmd $::SVN co http://svn...."
>>>>>>>>> >> >> >     (file "./Scripts/genlib.tcl" line 354)
>>>>>>>>> >> >> > child process exited abnormally
>>>>>>>>> >> >> > ERROR: failed to run getbuildtest: sh ./Scripts/genlib.tcl
>>>>>>>>> >> >> > /home/cvalencia/Slicer3/../Slicer3-lib --gcc -32
>>>>>>>>> --test-type
>>>>>>>>> >> >> > Experimental
>>>>>>>>> >> >> > cvalencia at cvalencia-Precision-WorkStation-T3400:~$
>>>>>>>>> >> >> >
>>>>>>>>> >> >> >
>>>>>>>>> >> >> > _______________________________________________
>>>>>>>>> >> >> > slicer-users mailing list
>>>>>>>>> >> >> > [hidden email]
>>>>>>>>> >> >> >
>>>>>>>>> http://massmail.spl.harvard.edu/mailman/listinfo/slicer-users
>>>>>>>>> >> >> > To unsubscribe: send email to [hidden email]
>>>>>>>>> >> >> > with unsubscribe as the subject
>>>>>>>>> >> >> >
>>>>>>>>> >> >> _______________________________________________
>>>>>>>>> >> >> slicer-users mailing list
>>>>>>>>> >> >> [hidden email]
>>>>>>>>> >> >>
>>>>>>>>> http://massmail.spl.harvard.edu/mailman/listinfo/slicer-users
>>>>>>>>> >> >> To unsubscribe: send email to [hidden email] with unsubscribe
>>>>>>>>> as the
>>>>>>>>> >> >> subject
>>>>>>>>> >> >>
>>>>>>>>> >> >>
>>>>>>>>> >> >> ________________________________
>>>>>>>>> >> >> If you reply to this email, your message will be added to the
>>>>>>>>> >> >> discussion
>>>>>>>>> >> >> below:
>>>>>>>>> >> >>
>>>>>>>>> >> >>
>>>>>>>>> >> >>
>>>>>>>>> http://slicer-users.65878.n3.nabble.com/Compile-ERROR-failed-to-run-getbuildtest-tp3249290p3249343.html
>>>>>>>>> >> >> To start a new topic under slicer-users, email [hidden email]
>>>>>>>>> >> >> To unsubscribe from slicer-users, click here.
>>>>>>>>> >> >
>>>>>>>>> >> >
>>>>>>>>> >> >
>>>>>>>>> >> > ________________________________
>>>>>>>>> >> > View this message in context: Re: Compile ERROR: failed to run
>>>>>>>>> >> > getbuildtest
>>>>>>>>> >> > Sent from the slicer-users mailing list archive at Nabble.com.
>>>>>>>>> >> >
>>>>>>>>> >> > _______________________________________________
>>>>>>>>> >> > slicer-users mailing list
>>>>>>>>> >> > [hidden email]
>>>>>>>>> >> > http://massmail.spl.harvard.edu/mailman/listinfo/slicer-users
>>>>>>>>> >> > To unsubscribe: send email to [hidden email]
>>>>>>>>> >> > with unsubscribe as the subject
>>>>>>>>> >> >
>>>>>>>>> >> _______________________________________________
>>>>>>>>> >> slicer-users mailing list
>>>>>>>>> >> [hidden email]
>>>>>>>>> >> http://massmail.spl.harvard.edu/mailman/listinfo/slicer-users
>>>>>>>>> >> To unsubscribe: send email to [hidden email] with unsubscribe as
>>>>>>>>> the
>>>>>>>>> >> subject
>>>>>>>>> >>
>>>>>>>>> >>
>>>>>>>>> >> ________________________________
>>>>>>>>> >> If you reply to this email, your message will be added to the
>>>>>>>>> discussion
>>>>>>>>> >> below:
>>>>>>>>> >>
>>>>>>>>> >>
>>>>>>>>> http://slicer-users.65878.n3.nabble.com/Compile-ERROR-failed-to-run-getbuildtest-tp3249290p3258753.html
>>>>>>>>> >> To start a new topic under slicer-users, email [hidden email]
>>>>>>>>> >> To unsubscribe from slicer-users, click here.
>>>>>>>>> >
>>>>>>>>> >
>>>>>>>>> >
>>>>>>>>> > ________________________________
>>>>>>>>> > View this message in context: Re: Compile ERROR: failed to run
>>>>>>>>> getbuildtest
>>>>>>>>> > Sent from the slicer-users mailing list archive at Nabble.com.
>>>>>>>>> >
>>>>>>>>> > _______________________________________________
>>>>>>>>> > slicer-users mailing list
>>>>>>>>> > slicer-users at bwh.harvard.edu
>>>>>>>>> > http://massmail.spl.harvard.edu/mailman/listinfo/slicer-users
>>>>>>>>> > To unsubscribe: send email to
>>>>>>>>> slicer-users-request at massmail.spl.harvard.edu
>>>>>>>>> > with unsubscribe as the subject
>>>>>>>>> >
>>>>>>>>>
>>>>>>>>
>>>>>>>>
>>>>>>>>
>>>>>>>>
>>>>>>>
>>>>>>>
>>>>>>> _______________________________________________
>>>>>>> slicer-users mailing list
>>>>>>> slicer-users at bwh.harvard.edu
>>>>>>> http://massmail.spl.harvard.edu/mailman/listinfo/slicer-users
>>>>>>> To unsubscribe: send email to
>>>>>>> slicer-users-request at massmail.spl.harvard.edu with unsubscribe as
>>>>>>> the subject
>>>>>>>
>>>>>>
>>>>>>
>>>>>
>>>>>
>>>>>
>>>>
>>>
>>>
>>
>
>
> --
>
-------------- next part --------------
An HTML attachment was scrubbed...
URL: <http://massmail.spl.harvard.edu/pipermail/slicer-users/attachments/20110819/f3850c2f/attachment.html>


More information about the slicer-users mailing list